{"text_format":"3","workbook":"xlsx","n_sheets":3,"sheets":["创新创业类","学科竞赛类","科研训练类"],"not_rendered":{"defined_names":3},"read":"whole","date_system":"1900"}

{"sheet":"创新创业类","index":0,"n_rows":150,"n_cols":17,"rows_kept":150,"merged":[[0,0,0,16],[1,0,1,16],[2,0,2,16],[3,0,5,0],[3,1,5,1],[3,2,5,2],[3,3,5,3],[3,4,5,4],[3,5,5,5],[3,6,5,6],[3,7,3,15],[3,16,5,16],[4,7,4,11],[4,12,4,15]]}
["上海海洋大学本科生创新创业教育实践学分认定汇总表（创新创业类）"]
["20  -20  学年第  学期"]
["审核人签名：                        教学院长（签名、学院盖章）：                      填表日期：                                                                                           "]
["序号","学号","姓名","认定课程名","认定课程号","认定学分","认定成绩","成果内容",{"$nulls":8},"已认定课程"]
[{"$nulls":7},"科创项目",{"$nulls":4},"注册公司"]
[{"$nulls":7},"项目类别","级别","项目名称","项目编号","参与情况","公司名称","注册时间","公司类型","注册资本"]
[null,null,{"$f":"VLOOKUP(B7,#REF!,2,0)","v":{"$error":"#REF!"}},{"$nulls":13},{"$f":"VLOOKUP(B7,#REF!,3,0)","v":{"$error":"#REF!"}}]
[null,null,{"$f":"VLOOKUP(B8,#REF!,2,0)","v":{"$error":"#REF!"}},{"$nulls":13},{"$f":"VLOOKUP(B8,#REF!,3,0)","v":{"$error":"#REF!"}}]
[null,null,{"$f":"VLOOKUP(B9,#REF!,2,0)","v":{"$error":"#REF!"}},{"$nulls":13},{"$f":"VLOOKUP(B9,#REF!,3,0)","v":{"$error":"#REF!"}}]
[null,null,{"$f":"VLOOKUP(B10,#REF!,2,0)","v":{"$error":"#REF!"}},{"$nulls":13},{"$f":"VLOOKUP(B10,#REF!,3,0)","v":{"$error":"#REF!"}}]
[null,null,{"$f":"VLOOKUP(B11,#REF!,2,0)","v":{"$error":"#REF!"}},{"$nulls":13},{"$f":"VLOOKUP(B11,#REF!,3,0)","v":{"$error":"#REF!"}}]
[null,null,{"$f":"VLOOKUP(B12,#REF!,2,0)","v":{"$error":"#REF!"}},{"$nulls":13},{"$f":"VLOOKUP(B12,#REF!,3,0)","v":{"$error":"#REF!"}}]
[null,null,{"$f":"VLOOKUP(B13,#REF!,2,0)","v":{"$error":"#REF!"}},{"$nulls":13},{"$f":"VLOOKUP(B13,#REF!,3,0)","v":{"$error":"#REF!"}}]
[null,null,{"$f":"VLOOKUP(B14,#REF!,2,0)","v":{"$error":"#REF!"}},{"$nulls":13},{"$f":"VLOOKUP(B14,#REF!,3,0)","v":{"$error":"#REF!"}}]
[null,null,{"$f":"VLOOKUP(B15,#REF!,2,0)","v":{"$error":"#REF!"}},{"$nulls":13},{"$f":"VLOOKUP(B15,#REF!,3,0)","v":{"$error":"#REF!"}}]
[null,null,{"$f":"VLOOKUP(B16,#REF!,2,0)","v":{"$error":"#REF!"}},{"$nulls":13},{"$f":"VLOOKUP(B16,#REF!,3,0)","v":{"$error":"#REF!"}}]
[null,null,{"$f":"VLOOKUP(B17,#REF!,2,0)","v":{"$error":"#REF!"}},{"$nulls":13},{"$f":"VLOOKUP(B17,#REF!,3,0)","v":{"$error":"#REF!"}}]
[null,null,{"$f":"VLOOKUP(B18,#REF!,2,0)","v":{"$error":"#REF!"}},{"$nulls":13},{"$f":"VLOOKUP(B18,#REF!,3,0)","v":{"$error":"#REF!"}}]
[null,null,{"$f":"VLOOKUP(B19,#REF!,2,0)","v":{"$error":"#REF!"}},{"$nulls":13},{"$f":"VLOOKUP(B19,#REF!,3,0)","v":{"$error":"#REF!"}}]
[null,null,{"$f":"VLOOKUP(B20,#REF!,2,0)","v":{"$error":"#REF!"}},{"$nulls":13},{"$f":"VLOOKUP(B20,#REF!,3,0)","v":{"$error":"#REF!"}}]
[null,null,{"$f":"VLOOKUP(B21,#REF!,2,0)","v":{"$error":"#REF!"}},{"$nulls":13},{"$f":"VLOOKUP(B21,#REF!,3,0)","v":{"$error":"#REF!"}}]
[null,null,{"$f":"VLOOKUP(B22,#REF!,2,0)","v":{"$error":"#REF!"}},{"$nulls":13},{"$f":"VLOOKUP(B22,#REF!,3,0)","v":{"$error":"#REF!"}}]
[null,null,{"$f":"VLOOKUP(B23,#REF!,2,0)","v":{"$error":"#REF!"}},{"$nulls":13},{"$f":"VLOOKUP(B23,#REF!,3,0)","v":{"$error":"#REF!"}}]
[null,null,{"$f":"VLOOKUP(B24,#REF!,2,0)","v":{"$error":"#REF!"}},{"$nulls":13},{"$f":"VLOOKUP(B24,#REF!,3,0)","v":{"$error":"#REF!"}}]
[null,null,{"$f":"VLOOKUP(B25,#REF!,2,0)","v":{"$error":"#REF!"}},{"$nulls":13},{"$f":"VLOOKUP(B25,#REF!,3,0)","v":{"$error":"#REF!"}}]
[null,null,{"$f":"VLOOKUP(B26,#REF!,2,0)","v":{"$error":"#REF!"}},{"$nulls":13},{"$f":"VLOOKUP(B26,#REF!,3,0)","v":{"$error":"#REF!"}}]
[null,null,{"$f":"VLOOKUP(B27,#REF!,2,0)","v":{"$error":"#REF!"}},{"$nulls":13},{"$f":"VLOOKUP(B27,#REF!,3,0)","v":{"$error":"#REF!"}}]
[null,null,{"$f":"VLOOKUP(B28,#REF!,2,0)","v":{"$error":"#REF!"}},{"$nulls":13},{"$f":"VLOOKUP(B28,#REF!,3,0)","v":{"$error":"#REF!"}}]
[null,null,{"$f":"VLOOKUP(B29,#REF!,2,0)","v":{"$error":"#REF!"}},{"$nulls":13},{"$f":"VLOOKUP(B29,#REF!,3,0)","v":{"$error":"#REF!"}}]
[null,null,{"$f":"VLOOKUP(B30,#REF!,2,0)","v":{"$error":"#REF!"}},{"$nulls":13},{"$f":"VLOOKUP(B30,#REF!,3,0)","v":{"$error":"#REF!"}}]
[null,null,{"$f":"VLOOKUP(B31,#REF!,2,0)","v":{"$error":"#REF!"}},{"$nulls":13},{"$f":"VLOOKUP(B31,#REF!,3,0)","v":{"$error":"#REF!"}}]
[null,null,{"$f":"VLOOKUP(B32,#REF!,2,0)","v":{"$error":"#REF!"}},{"$nulls":13},{"$f":"VLOOKUP(B32,#REF!,3,0)","v":{"$error":"#REF!"}}]
[null,null,{"$f":"VLOOKUP(B33,#REF!,2,0)","v":{"$error":"#REF!"}},{"$nulls":13},{"$f":"VLOOKUP(B33,#REF!,3,0)","v":{"$error":"#REF!"}}]
[null,null,{"$f":"VLOOKUP(B34,#REF!,2,0)","v":{"$error":"#REF!"}},{"$nulls":13},{"$f":"VLOOKUP(B34,#REF!,3,0)","v":{"$error":"#REF!"}}]
[null,null,{"$f":"VLOOKUP(B35,#REF!,2,0)","v":{"$error":"#REF!"}},{"$nulls":13},{"$f":"VLOOKUP(B35,#REF!,3,0)","v":{"$error":"#REF!"}}]
[null,null,{"$f":"VLOOKUP(B36,#REF!,2,0)","v":{"$error":"#REF!"}},{"$nulls":13},{"$f":"VLOOKUP(B36,#REF!,3,0)","v":{"$error":"#REF!"}}]
[null,null,{"$f":"VLOOKUP(B37,#REF!,2,0)","v":{"$error":"#REF!"}},{"$nulls":13},{"$f":"VLOOKUP(B37,#REF!,3,0)","v":{"$error":"#REF!"}}]
[null,null,{"$f":"VLOOKUP(B38,#REF!,2,0)","v":{"$error":"#REF!"}},{"$nulls":13},{"$f":"VLOOKUP(B38,#REF!,3,0)","v":{"$error":"#REF!"}}]
[null,null,{"$f":"VLOOKUP(B39,#REF!,2,0)","v":{"$error":"#REF!"}},{"$nulls":13},{"$f":"VLOOKUP(B39,#REF!,3,0)","v":{"$error":"#REF!"}}]
[null,null,{"$f":"VLOOKUP(B40,#REF!,2,0)","v":{"$error":"#REF!"}},{"$nulls":13},{"$f":"VLOOKUP(B40,#REF!,3,0)","v":{"$error":"#REF!"}}]
[null,null,{"$f":"VLOOKUP(B41,#REF!,2,0)","v":{"$error":"#REF!"}},{"$nulls":13},{"$f":"VLOOKUP(B41,#REF!,3,0)","v":{"$error":"#REF!"}}]
[null,null,{"$f":"VLOOKUP(B42,#REF!,2,0)","v":{"$error":"#REF!"}},{"$nulls":13},{"$f":"VLOOKUP(B42,#REF!,3,0)","v":{"$error":"#REF!"}}]
[null,null,{"$f":"VLOOKUP(B43,#REF!,2,0)","v":{"$error":"#REF!"}},{"$nulls":13},{"$f":"VLOOKUP(B43,#REF!,3,0)","v":{"$error":"#REF!"}}]
[null,null,{"$f":"VLOOKUP(B44,#REF!,2,0)","v":{"$error":"#REF!"}},{"$nulls":13},{"$f":"VLOOKUP(B44,#REF!,3,0)","v":{"$error":"#REF!"}}]
[null,null,{"$f":"VLOOKUP(B45,#REF!,2,0)","v":{"$error":"#REF!"}},{"$nulls":13},{"$f":"VLOOKUP(B45,#REF!,3,0)","v":{"$error":"#REF!"}}]
[null,null,{"$f":"VLOOKUP(B46,#REF!,2,0)","v":{"$error":"#REF!"}},{"$nulls":13},{"$f":"VLOOKUP(B46,#REF!,3,0)","v":{"$error":"#REF!"}}]
[null,null,{"$f":"VLOOKUP(B47,#REF!,2,0)","v":{"$error":"#REF!"}},{"$nulls":13},{"$f":"VLOOKUP(B47,#REF!,3,0)","v":{"$error":"#REF!"}}]
[null,null,{"$f":"VLOOKUP(B48,#REF!,2,0)","v":{"$error":"#REF!"}},{"$nulls":13},{"$f":"VLOOKUP(B48,#REF!,3,0)","v":{"$error":"#REF!"}}]
[null,null,{"$f":"VLOOKUP(B49,#REF!,2,0)","v":{"$error":"#REF!"}},{"$nulls":13},{"$f":"VLOOKUP(B49,#REF!,3,0)","v":{"$error":"#REF!"}}]
[null,null,{"$f":"VLOOKUP(B50,#REF!,2,0)","v":{"$error":"#REF!"}},{"$nulls":13},{"$f":"VLOOKUP(B50,#REF!,3,0)","v":{"$error":"#REF!"}}]
[null,null,{"$f":"VLOOKUP(B51,#REF!,2,0)","v":{"$error":"#REF!"}},{"$nulls":13},{"$f":"VLOOKUP(B51,#REF!,3,0)","v":{"$error":"#REF!"}}]
[null,null,{"$f":"VLOOKUP(B52,#REF!,2,0)","v":{"$error":"#REF!"}},{"$nulls":13},{"$f":"VLOOKUP(B52,#REF!,3,0)","v":{"$error":"#REF!"}}]
[null,null,{"$f":"VLOOKUP(B53,#REF!,2,0)","v":{"$error":"#REF!"}},{"$nulls":13},{"$f":"VLOOKUP(B53,#REF!,3,0)","v":{"$error":"#REF!"}}]
[null,null,{"$f":"VLOOKUP(B54,#REF!,2,0)","v":{"$error":"#REF!"}},{"$nulls":13},{"$f":"VLOOKUP(B54,#REF!,3,0)","v":{"$error":"#REF!"}}]
[null,null,{"$f":"VLOOKUP(B55,#REF!,2,0)","v":{"$error":"#REF!"}},{"$nulls":13},{"$f":"VLOOKUP(B55,#REF!,3,0)","v":{"$error":"#REF!"}}]
[null,null,{"$f":"VLOOKUP(B56,#REF!,2,0)","v":{"$error":"#REF!"}},{"$nulls":13},{"$f":"VLOOKUP(B56,#REF!,3,0)","v":{"$error":"#REF!"}}]
[null,null,{"$f":"VLOOKUP(B57,#REF!,2,0)","v":{"$error":"#REF!"}},{"$nulls":13},{"$f":"VLOOKUP(B57,#REF!,3,0)","v":{"$error":"#REF!"}}]
[null,null,{"$f":"VLOOKUP(B58,#REF!,2,0)","v":{"$error":"#REF!"}},{"$nulls":13},{"$f":"VLOOKUP(B58,#REF!,3,0)","v":{"$error":"#REF!"}}]
[null,null,{"$f":"VLOOKUP(B59,#REF!,2,0)","v":{"$error":"#REF!"}},{"$nulls":13},{"$f":"VLOOKUP(B59,#REF!,3,0)","v":{"$error":"#REF!"}}]
[null,null,{"$f":"VLOOKUP(B60,#REF!,2,0)","v":{"$error":"#REF!"}},{"$nulls":13},{"$f":"VLOOKUP(B60,#REF!,3,0)","v":{"$error":"#REF!"}}]
{"$rows_left_out":91}
{"sheet":"学科竞赛类","index":1,"n_rows":120,"n_cols":14,"rows_kept":120,"merged":[[0,0,0,13],[1,0,1,13],[2,0,2,13],[3,0,5,0],[3,1,5,1],[3,2,5,2],[3,3,5,3],[3,4,5,4],[3,5,5,5],[3,6,5,6],[3,7,3,12],[3,13,5,13],[4,7,4,12]]}
["上海海洋大学本科生创新创业教育实践学分认定汇总表（学科竞赛类）"]
["20  -20  学年第  学期"]
["审核人签名：                        教学院长（签名、学院盖章）：                     填表日期：                                                                                           "]
["序号","学号","姓名","认定课程名","认定课程号","认定学分","认定成绩","成果内容",{"$nulls":5},"已认定课程"]
[{"$nulls":7},"学科竞赛"]
[{"$nulls":7},"竞赛名称","立项级别（A+/A/B/C）","获奖作品/团队名称","获奖级别（国家级/省市级/校级）","获奖等级（特等奖、一等奖、二等奖、三等奖……）","获奖时间\n（年月）"]
[null,null,{"$f":"VLOOKUP(B7,#REF!,2,0)","v":{"$error":"#REF!"}},{"$nulls":10},{"$f":"VLOOKUP(B7,#REF!,3,0)","v":{"$error":"#REF!"}}]
[null,null,{"$f":"VLOOKUP(B8,#REF!,2,0)","v":{"$error":"#REF!"}},{"$nulls":10},{"$f":"VLOOKUP(B8,#REF!,3,0)","v":{"$error":"#REF!"}}]
[null,null,{"$f":"VLOOKUP(B9,#REF!,2,0)","v":{"$error":"#REF!"}},{"$nulls":10},{"$f":"VLOOKUP(B9,#REF!,3,0)","v":{"$error":"#REF!"}}]
[null,null,{"$f":"VLOOKUP(B10,#REF!,2,0)","v":{"$error":"#REF!"}},{"$nulls":10},{"$f":"VLOOKUP(B10,#REF!,3,0)","v":{"$error":"#REF!"}}]
[null,null,{"$f":"VLOOKUP(B11,#REF!,2,0)","v":{"$error":"#REF!"}},{"$nulls":10},{"$f":"VLOOKUP(B11,#REF!,3,0)","v":{"$error":"#REF!"}}]
[null,null,{"$f":"VLOOKUP(B12,#REF!,2,0)","v":{"$error":"#REF!"}},{"$nulls":10},{"$f":"VLOOKUP(B12,#REF!,3,0)","v":{"$error":"#REF!"}}]
[null,null,{"$f":"VLOOKUP(B13,#REF!,2,0)","v":{"$error":"#REF!"}},{"$nulls":10},{"$f":"VLOOKUP(B13,#REF!,3,0)","v":{"$error":"#REF!"}}]
[null,null,{"$f":"VLOOKUP(B14,#REF!,2,0)","v":{"$error":"#REF!"}},{"$nulls":10},{"$f":"VLOOKUP(B14,#REF!,3,0)","v":{"$error":"#REF!"}}]
[null,null,{"$f":"VLOOKUP(B15,#REF!,2,0)","v":{"$error":"#REF!"}},{"$nulls":10},{"$f":"VLOOKUP(B15,#REF!,3,0)","v":{"$error":"#REF!"}}]
[null,null,{"$f":"VLOOKUP(B16,#REF!,2,0)","v":{"$error":"#REF!"}},{"$nulls":10},{"$f":"VLOOKUP(B16,#REF!,3,0)","v":{"$error":"#REF!"}}]
[null,null,{"$f":"VLOOKUP(B17,#REF!,2,0)","v":{"$error":"#REF!"}},{"$nulls":10},{"$f":"VLOOKUP(B17,#REF!,3,0)","v":{"$error":"#REF!"}}]
[null,null,{"$f":"VLOOKUP(B18,#REF!,2,0)","v":{"$error":"#REF!"}},{"$nulls":10},{"$f":"VLOOKUP(B18,#REF!,3,0)","v":{"$error":"#REF!"}}]
[null,null,{"$f":"VLOOKUP(B19,#REF!,2,0)","v":{"$error":"#REF!"}},{"$nulls":10},{"$f":"VLOOKUP(B19,#REF!,3,0)","v":{"$error":"#REF!"}}]
[null,null,{"$f":"VLOOKUP(B20,#REF!,2,0)","v":{"$error":"#REF!"}},{"$nulls":10},{"$f":"VLOOKUP(B20,#REF!,3,0)","v":{"$error":"#REF!"}}]
[null,null,{"$f":"VLOOKUP(B21,#REF!,2,0)","v":{"$error":"#REF!"}},{"$nulls":10},{"$f":"VLOOKUP(B21,#REF!,3,0)","v":{"$error":"#REF!"}}]
[null,null,{"$f":"VLOOKUP(B22,#REF!,2,0)","v":{"$error":"#REF!"}},{"$nulls":10},{"$f":"VLOOKUP(B22,#REF!,3,0)","v":{"$error":"#REF!"}}]
[null,null,{"$f":"VLOOKUP(B23,#REF!,2,0)","v":{"$error":"#REF!"}},{"$nulls":10},{"$f":"VLOOKUP(B23,#REF!,3,0)","v":{"$error":"#REF!"}}]
[null,null,{"$f":"VLOOKUP(B24,#REF!,2,0)","v":{"$error":"#REF!"}},{"$nulls":10},{"$f":"VLOOKUP(B24,#REF!,3,0)","v":{"$error":"#REF!"}}]
[null,null,{"$f":"VLOOKUP(B25,#REF!,2,0)","v":{"$error":"#REF!"}},{"$nulls":10},{"$f":"VLOOKUP(B25,#REF!,3,0)","v":{"$error":"#REF!"}}]
[null,null,{"$f":"VLOOKUP(B26,#REF!,2,0)","v":{"$error":"#REF!"}},{"$nulls":10},{"$f":"VLOOKUP(B26,#REF!,3,0)","v":{"$error":"#REF!"}}]
[null,null,{"$f":"VLOOKUP(B27,#REF!,2,0)","v":{"$error":"#REF!"}},{"$nulls":10},{"$f":"VLOOKUP(B27,#REF!,3,0)","v":{"$error":"#REF!"}}]
[null,null,{"$f":"VLOOKUP(B28,#REF!,2,0)","v":{"$error":"#REF!"}},{"$nulls":10},{"$f":"VLOOKUP(B28,#REF!,3,0)","v":{"$error":"#REF!"}}]
[null,null,{"$f":"VLOOKUP(B29,#REF!,2,0)","v":{"$error":"#REF!"}},{"$nulls":10},{"$f":"VLOOKUP(B29,#REF!,3,0)","v":{"$error":"#REF!"}}]
[null,null,{"$f":"VLOOKUP(B30,#REF!,2,0)","v":{"$error":"#REF!"}},{"$nulls":10},{"$f":"VLOOKUP(B30,#REF!,3,0)","v":{"$error":"#REF!"}}]
[null,null,{"$f":"VLOOKUP(B31,#REF!,2,0)","v":{"$error":"#REF!"}},{"$nulls":10},{"$f":"VLOOKUP(B31,#REF!,3,0)","v":{"$error":"#REF!"}}]
[null,null,{"$f":"VLOOKUP(B32,#REF!,2,0)","v":{"$error":"#REF!"}},{"$nulls":10},{"$f":"VLOOKUP(B32,#REF!,3,0)","v":{"$error":"#REF!"}}]
[null,null,{"$f":"VLOOKUP(B33,#REF!,2,0)","v":{"$error":"#REF!"}},{"$nulls":10},{"$f":"VLOOKUP(B33,#REF!,3,0)","v":{"$error":"#REF!"}}]
[null,null,{"$f":"VLOOKUP(B34,#REF!,2,0)","v":{"$error":"#REF!"}},{"$nulls":10},{"$f":"VLOOKUP(B34,#REF!,3,0)","v":{"$error":"#REF!"}}]
[null,null,{"$f":"VLOOKUP(B35,#REF!,2,0)","v":{"$error":"#REF!"}},{"$nulls":10},{"$f":"VLOOKUP(B35,#REF!,3,0)","v":{"$error":"#REF!"}}]
[null,null,{"$f":"VLOOKUP(B36,#REF!,2,0)","v":{"$error":"#REF!"}},{"$nulls":10},{"$f":"VLOOKUP(B36,#REF!,3,0)","v":{"$error":"#REF!"}}]
[null,null,{"$f":"VLOOKUP(B37,#REF!,2,0)","v":{"$error":"#REF!"}},{"$nulls":10},{"$f":"VLOOKUP(B37,#REF!,3,0)","v":{"$error":"#REF!"}}]
[null,null,{"$f":"VLOOKUP(B38,#REF!,2,0)","v":{"$error":"#REF!"}},{"$nulls":10},{"$f":"VLOOKUP(B38,#REF!,3,0)","v":{"$error":"#REF!"}}]
[null,null,{"$f":"VLOOKUP(B39,#REF!,2,0)","v":{"$error":"#REF!"}},{"$nulls":10},{"$f":"VLOOKUP(B39,#REF!,3,0)","v":{"$error":"#REF!"}}]
[null,null,{"$f":"VLOOKUP(B40,#REF!,2,0)","v":{"$error":"#REF!"}},{"$nulls":10},{"$f":"VLOOKUP(B40,#REF!,3,0)","v":{"$error":"#REF!"}}]
[null,null,{"$f":"VLOOKUP(B41,#REF!,2,0)","v":{"$error":"#REF!"}},{"$nulls":10},{"$f":"VLOOKUP(B41,#REF!,3,0)","v":{"$error":"#REF!"}}]
[null,null,{"$f":"VLOOKUP(B42,#REF!,2,0)","v":{"$error":"#REF!"}},{"$nulls":10},{"$f":"VLOOKUP(B42,#REF!,3,0)","v":{"$error":"#REF!"}}]
[null,null,{"$f":"VLOOKUP(B43,#REF!,2,0)","v":{"$error":"#REF!"}},{"$nulls":10},{"$f":"VLOOKUP(B43,#REF!,3,0)","v":{"$error":"#REF!"}}]
[null,null,{"$f":"VLOOKUP(B44,#REF!,2,0)","v":{"$error":"#REF!"}},{"$nulls":10},{"$f":"VLOOKUP(B44,#REF!,3,0)","v":{"$error":"#REF!"}}]
[null,null,{"$f":"VLOOKUP(B45,#REF!,2,0)","v":{"$error":"#REF!"}},{"$nulls":10},{"$f":"VLOOKUP(B45,#REF!,3,0)","v":{"$error":"#REF!"}}]
[null,null,{"$f":"VLOOKUP(B46,#REF!,2,0)","v":{"$error":"#REF!"}},{"$nulls":10},{"$f":"VLOOKUP(B46,#REF!,3,0)","v":{"$error":"#REF!"}}]
[null,null,{"$f":"VLOOKUP(B47,#REF!,2,0)","v":{"$error":"#REF!"}},{"$nulls":10},{"$f":"VLOOKUP(B47,#REF!,3,0)","v":{"$error":"#REF!"}}]
[null,null,{"$f":"VLOOKUP(B48,#REF!,2,0)","v":{"$error":"#REF!"}},{"$nulls":10},{"$f":"VLOOKUP(B48,#REF!,3,0)","v":{"$error":"#REF!"}}]
[null,null,{"$f":"VLOOKUP(B49,#REF!,2,0)","v":{"$error":"#REF!"}},{"$nulls":10},{"$f":"VLOOKUP(B49,#REF!,3,0)","v":{"$error":"#REF!"}}]
[null,null,{"$f":"VLOOKUP(B50,#REF!,2,0)","v":{"$error":"#REF!"}},{"$nulls":10},{"$f":"VLOOKUP(B50,#REF!,3,0)","v":{"$error":"#REF!"}}]
[null,null,{"$f":"VLOOKUP(B51,#REF!,2,0)","v":{"$error":"#REF!"}},{"$nulls":10},{"$f":"VLOOKUP(B51,#REF!,3,0)","v":{"$error":"#REF!"}}]
[null,null,{"$f":"VLOOKUP(B52,#REF!,2,0)","v":{"$error":"#REF!"}},{"$nulls":10},{"$f":"VLOOKUP(B52,#REF!,3,0)","v":{"$error":"#REF!"}}]
[null,null,{"$f":"VLOOKUP(B53,#REF!,2,0)","v":{"$error":"#REF!"}},{"$nulls":10},{"$f":"VLOOKUP(B53,#REF!,3,0)","v":{"$error":"#REF!"}}]
[null,null,{"$f":"VLOOKUP(B54,#REF!,2,0)","v":{"$error":"#REF!"}},{"$nulls":10},{"$f":"VLOOKUP(B54,#REF!,3,0)","v":{"$error":"#REF!"}}]
[null,null,{"$f":"VLOOKUP(B55,#REF!,2,0)","v":{"$error":"#REF!"}},{"$nulls":10},{"$f":"VLOOKUP(B55,#REF!,3,0)","v":{"$error":"#REF!"}}]
[null,null,{"$f":"VLOOKUP(B56,#REF!,2,0)","v":{"$error":"#REF!"}},{"$nulls":10},{"$f":"VLOOKUP(B56,#REF!,3,0)","v":{"$error":"#REF!"}}]
[null,null,{"$f":"VLOOKUP(B57,#REF!,2,0)","v":{"$error":"#REF!"}},{"$nulls":10},{"$f":"VLOOKUP(B57,#REF!,3,0)","v":{"$error":"#REF!"}}]
[null,null,{"$f":"VLOOKUP(B58,#REF!,2,0)","v":{"$error":"#REF!"}},{"$nulls":10},{"$f":"VLOOKUP(B58,#REF!,3,0)","v":{"$error":"#REF!"}}]
[null,null,{"$f":"VLOOKUP(B59,#REF!,2,0)","v":{"$error":"#REF!"}},{"$nulls":10},{"$f":"VLOOKUP(B59,#REF!,3,0)","v":{"$error":"#REF!"}}]
[null,null,{"$f":"VLOOKUP(B60,#REF!,2,0)","v":{"$error":"#REF!"}},{"$nulls":10},{"$f":"VLOOKUP(B60,#REF!,3,0)","v":{"$error":"#REF!"}}]
{"$rows_left_out":61}
{"sheet":"科研训练类","index":2,"n_rows":65,"n_cols":27,"rows_kept":65,"merged":[[0,0,0,26],[1,0,1,26],[2,0,2,26],[3,0,5,0],[3,1,5,1],[3,2,5,2],[3,3,5,3],[3,4,5,4],[3,5,5,5],[3,6,5,6],[3,7,3,25],[3,26,5,26],[4,7,4,11],[4,12,4,16],[4,17,4,21],[4,22,4,25]]}
["上海海洋大学本科生创新创业教育实践学分认定汇总表（科研训练类）"]
["20  -20  学年第  学期"]
["审核人签名：                               教学院长（签名、学院盖章）：                              填表日期：                                                                                           "]
["序号","学号","姓名","认定课程名","认定课程号","认定学分","认定成绩","成果内容",{"$nulls":18},"已认定课程"]
[{"$nulls":7},"科研项目",{"$nulls":4},"专利（著作权）",{"$nulls":4},"发表论文",{"$nulls":4},"参加国际学术会议"]
[{"$nulls":7},"科研项目类别","指导教师","参与项目时间","科研项目名称","科研项目编号","获批时间","专利/著作权名称","专利/著作权类型","作者排序","专利号/著作权登记号","发表时间\n（年月）","论文名称","刊物名称","作者排序","收录情况","参会时间\n（年月）","参会交流论文名称","会议名称","会议地点\n（国家-省市）"]
[null,null,{"$f":"VLOOKUP(B7,#REF!,2,0)","v":{"$error":"#REF!"}},{"$nulls":23},{"$f":"VLOOKUP(B7,#REF!,3,0)","v":{"$error":"#REF!"}}]
[null,null,{"$f":"VLOOKUP(B8,#REF!,2,0)","v":{"$error":"#REF!"}},{"$nulls":23},{"$f":"VLOOKUP(B8,#REF!,3,0)","v":{"$error":"#REF!"}}]
[null,null,{"$f":"VLOOKUP(B9,#REF!,2,0)","v":{"$error":"#REF!"}},{"$nulls":23},{"$f":"VLOOKUP(B9,#REF!,3,0)","v":{"$error":"#REF!"}}]
[null,null,{"$f":"VLOOKUP(B10,#REF!,2,0)","v":{"$error":"#REF!"}},{"$nulls":23},{"$f":"VLOOKUP(B10,#REF!,3,0)","v":{"$error":"#REF!"}}]
[null,null,{"$f":"VLOOKUP(B11,#REF!,2,0)","v":{"$error":"#REF!"}},{"$nulls":23},{"$f":"VLOOKUP(B11,#REF!,3,0)","v":{"$error":"#REF!"}}]
[null,null,{"$f":"VLOOKUP(B12,#REF!,2,0)","v":{"$error":"#REF!"}},{"$nulls":23},{"$f":"VLOOKUP(B12,#REF!,3,0)","v":{"$error":"#REF!"}}]
[null,null,{"$f":"VLOOKUP(B13,#REF!,2,0)","v":{"$error":"#REF!"}},{"$nulls":23},{"$f":"VLOOKUP(B13,#REF!,3,0)","v":{"$error":"#REF!"}}]
[null,null,{"$f":"VLOOKUP(B14,#REF!,2,0)","v":{"$error":"#REF!"}},{"$nulls":23},{"$f":"VLOOKUP(B14,#REF!,3,0)","v":{"$error":"#REF!"}}]
[null,null,{"$f":"VLOOKUP(B15,#REF!,2,0)","v":{"$error":"#REF!"}},{"$nulls":23},{"$f":"VLOOKUP(B15,#REF!,3,0)","v":{"$error":"#REF!"}}]
[null,null,{"$f":"VLOOKUP(B16,#REF!,2,0)","v":{"$error":"#REF!"}},{"$nulls":23},{"$f":"VLOOKUP(B16,#REF!,3,0)","v":{"$error":"#REF!"}}]
[null,null,{"$f":"VLOOKUP(B17,#REF!,2,0)","v":{"$error":"#REF!"}},{"$nulls":23},{"$f":"VLOOKUP(B17,#REF!,3,0)","v":{"$error":"#REF!"}}]
[null,null,{"$f":"VLOOKUP(B18,#REF!,2,0)","v":{"$error":"#REF!"}},{"$nulls":23},{"$f":"VLOOKUP(B18,#REF!,3,0)","v":{"$error":"#REF!"}}]
[null,null,{"$f":"VLOOKUP(B19,#REF!,2,0)","v":{"$error":"#REF!"}},{"$nulls":23},{"$f":"VLOOKUP(B19,#REF!,3,0)","v":{"$error":"#REF!"}}]
[null,null,{"$f":"VLOOKUP(B20,#REF!,2,0)","v":{"$error":"#REF!"}},{"$nulls":23},{"$f":"VLOOKUP(B20,#REF!,3,0)","v":{"$error":"#REF!"}}]
[null,null,{"$f":"VLOOKUP(B21,#REF!,2,0)","v":{"$error":"#REF!"}},{"$nulls":23},{"$f":"VLOOKUP(B21,#REF!,3,0)","v":{"$error":"#REF!"}}]
[null,null,{"$f":"VLOOKUP(B22,#REF!,2,0)","v":{"$error":"#REF!"}},{"$nulls":23},{"$f":"VLOOKUP(B22,#REF!,3,0)","v":{"$error":"#REF!"}}]
[null,null,{"$f":"VLOOKUP(B23,#REF!,2,0)","v":{"$error":"#REF!"}},{"$nulls":23},{"$f":"VLOOKUP(B23,#REF!,3,0)","v":{"$error":"#REF!"}}]
[null,null,{"$f":"VLOOKUP(B24,#REF!,2,0)","v":{"$error":"#REF!"}},{"$nulls":23},{"$f":"VLOOKUP(B24,#REF!,3,0)","v":{"$error":"#REF!"}}]
[null,null,{"$f":"VLOOKUP(B25,#REF!,2,0)","v":{"$error":"#REF!"}},{"$nulls":23},{"$f":"VLOOKUP(B25,#REF!,3,0)","v":{"$error":"#REF!"}}]
[null,null,{"$f":"VLOOKUP(B26,#REF!,2,0)","v":{"$error":"#REF!"}},{"$nulls":23},{"$f":"VLOOKUP(B26,#REF!,3,0)","v":{"$error":"#REF!"}}]
[null,null,{"$f":"VLOOKUP(B27,#REF!,2,0)","v":{"$error":"#REF!"}},{"$nulls":23},{"$f":"VLOOKUP(B27,#REF!,3,0)","v":{"$error":"#REF!"}}]
[null,null,{"$f":"VLOOKUP(B28,#REF!,2,0)","v":{"$error":"#REF!"}},{"$nulls":23},{"$f":"VLOOKUP(B28,#REF!,3,0)","v":{"$error":"#REF!"}}]
[null,null,{"$f":"VLOOKUP(B29,#REF!,2,0)","v":{"$error":"#REF!"}},{"$nulls":23},{"$f":"VLOOKUP(B29,#REF!,3,0)","v":{"$error":"#REF!"}}]
[null,null,{"$f":"VLOOKUP(B30,#REF!,2,0)","v":{"$error":"#REF!"}},{"$nulls":23},{"$f":"VLOOKUP(B30,#REF!,3,0)","v":{"$error":"#REF!"}}]
[null,null,{"$f":"VLOOKUP(B31,#REF!,2,0)","v":{"$error":"#REF!"}},{"$nulls":23},{"$f":"VLOOKUP(B31,#REF!,3,0)","v":{"$error":"#REF!"}}]
[null,null,{"$f":"VLOOKUP(B32,#REF!,2,0)","v":{"$error":"#REF!"}},{"$nulls":23},{"$f":"VLOOKUP(B32,#REF!,3,0)","v":{"$error":"#REF!"}}]
[null,null,{"$f":"VLOOKUP(B33,#REF!,2,0)","v":{"$error":"#REF!"}},{"$nulls":23},{"$f":"VLOOKUP(B33,#REF!,3,0)","v":{"$error":"#REF!"}}]
[null,null,{"$f":"VLOOKUP(B34,#REF!,2,0)","v":{"$error":"#REF!"}},{"$nulls":23},{"$f":"VLOOKUP(B34,#REF!,3,0)","v":{"$error":"#REF!"}}]
[null,null,{"$f":"VLOOKUP(B35,#REF!,2,0)","v":{"$error":"#REF!"}},{"$nulls":23},{"$f":"VLOOKUP(B35,#REF!,3,0)","v":{"$error":"#REF!"}}]
[null,null,{"$f":"VLOOKUP(B36,#REF!,2,0)","v":{"$error":"#REF!"}},{"$nulls":23},{"$f":"VLOOKUP(B36,#REF!,3,0)","v":{"$error":"#REF!"}}]
[null,null,{"$f":"VLOOKUP(B37,#REF!,2,0)","v":{"$error":"#REF!"}},{"$nulls":23},{"$f":"VLOOKUP(B37,#REF!,3,0)","v":{"$error":"#REF!"}}]
[null,null,{"$f":"VLOOKUP(B38,#REF!,2,0)","v":{"$error":"#REF!"}},{"$nulls":23},{"$f":"VLOOKUP(B38,#REF!,3,0)","v":{"$error":"#REF!"}}]
[null,null,{"$f":"VLOOKUP(B39,#REF!,2,0)","v":{"$error":"#REF!"}},{"$nulls":23},{"$f":"VLOOKUP(B39,#REF!,3,0)","v":{"$error":"#REF!"}}]
[null,null,{"$f":"VLOOKUP(B40,#REF!,2,0)","v":{"$error":"#REF!"}},{"$nulls":23},{"$f":"VLOOKUP(B40,#REF!,3,0)","v":{"$error":"#REF!"}}]
[null,null,{"$f":"VLOOKUP(B41,#REF!,2,0)","v":{"$error":"#REF!"}},{"$nulls":23},{"$f":"VLOOKUP(B41,#REF!,3,0)","v":{"$error":"#REF!"}}]
[null,null,{"$f":"VLOOKUP(B42,#REF!,2,0)","v":{"$error":"#REF!"}},{"$nulls":23},{"$f":"VLOOKUP(B42,#REF!,3,0)","v":{"$error":"#REF!"}}]
[null,null,{"$f":"VLOOKUP(B43,#REF!,2,0)","v":{"$error":"#REF!"}},{"$nulls":23},{"$f":"VLOOKUP(B43,#REF!,3,0)","v":{"$error":"#REF!"}}]
[null,null,{"$f":"VLOOKUP(B44,#REF!,2,0)","v":{"$error":"#REF!"}},{"$nulls":23},{"$f":"VLOOKUP(B44,#REF!,3,0)","v":{"$error":"#REF!"}}]
[null,null,{"$f":"VLOOKUP(B45,#REF!,2,0)","v":{"$error":"#REF!"}},{"$nulls":23},{"$f":"VLOOKUP(B45,#REF!,3,0)","v":{"$error":"#REF!"}}]
[null,null,{"$f":"VLOOKUP(B46,#REF!,2,0)","v":{"$error":"#REF!"}},{"$nulls":23},{"$f":"VLOOKUP(B46,#REF!,3,0)","v":{"$error":"#REF!"}}]
[null,null,{"$f":"VLOOKUP(B47,#REF!,2,0)","v":{"$error":"#REF!"}},{"$nulls":23},{"$f":"VLOOKUP(B47,#REF!,3,0)","v":{"$error":"#REF!"}}]
[null,null,{"$f":"VLOOKUP(B48,#REF!,2,0)","v":{"$error":"#REF!"}},{"$nulls":23},{"$f":"VLOOKUP(B48,#REF!,3,0)","v":{"$error":"#REF!"}}]
[null,null,{"$f":"VLOOKUP(B49,#REF!,2,0)","v":{"$error":"#REF!"}},{"$nulls":23},{"$f":"VLOOKUP(B49,#REF!,3,0)","v":{"$error":"#REF!"}}]
[null,null,{"$f":"VLOOKUP(B50,#REF!,2,0)","v":{"$error":"#REF!"}},{"$nulls":23},{"$f":"VLOOKUP(B50,#REF!,3,0)","v":{"$error":"#REF!"}}]
[null,null,{"$f":"VLOOKUP(B51,#REF!,2,0)","v":{"$error":"#REF!"}},{"$nulls":23},{"$f":"VLOOKUP(B51,#REF!,3,0)","v":{"$error":"#REF!"}}]
[null,null,{"$f":"VLOOKUP(B52,#REF!,2,0)","v":{"$error":"#REF!"}},{"$nulls":23},{"$f":"VLOOKUP(B52,#REF!,3,0)","v":{"$error":"#REF!"}}]
[null,null,{"$f":"VLOOKUP(B53,#REF!,2,0)","v":{"$error":"#REF!"}},{"$nulls":23},{"$f":"VLOOKUP(B53,#REF!,3,0)","v":{"$error":"#REF!"}}]
[null,null,{"$f":"VLOOKUP(B54,#REF!,2,0)","v":{"$error":"#REF!"}},{"$nulls":23},{"$f":"VLOOKUP(B54,#REF!,3,0)","v":{"$error":"#REF!"}}]
[null,null,{"$f":"VLOOKUP(B55,#REF!,2,0)","v":{"$error":"#REF!"}},{"$nulls":23},{"$f":"VLOOKUP(B55,#REF!,3,0)","v":{"$error":"#REF!"}}]
[null,null,{"$f":"VLOOKUP(B56,#REF!,2,0)","v":{"$error":"#REF!"}},{"$nulls":23},{"$f":"VLOOKUP(B56,#REF!,3,0)","v":{"$error":"#REF!"}}]
[null,null,{"$f":"VLOOKUP(B57,#REF!,2,0)","v":{"$error":"#REF!"}},{"$nulls":23},{"$f":"VLOOKUP(B57,#REF!,3,0)","v":{"$error":"#REF!"}}]
[null,null,{"$f":"VLOOKUP(B58,#REF!,2,0)","v":{"$error":"#REF!"}},{"$nulls":23},{"$f":"VLOOKUP(B58,#REF!,3,0)","v":{"$error":"#REF!"}}]
[null,null,{"$f":"VLOOKUP(B59,#REF!,2,0)","v":{"$error":"#REF!"}},{"$nulls":23},{"$f":"VLOOKUP(B59,#REF!,3,0)","v":{"$error":"#REF!"}}]
[null,null,{"$f":"VLOOKUP(B60,#REF!,2,0)","v":{"$error":"#REF!"}},{"$nulls":23},{"$f":"VLOOKUP(B60,#REF!,3,0)","v":{"$error":"#REF!"}}]
{"$rows_left_out":5}